Usr bin ld cannot find - 1 Answer. Sorted by: 3. The makefile is generating a link command that reads: ... -l -L/usr/lib ... The link command in the makefile is likely specified as -l$ …

 
Usr bin ld cannot findUsr bin ld cannot find - Sep 15, 2020 · /usr/bin/ld: cannot find during linking g++. Load 7 more related questions Show fewer related questions Sorted by: Reset to default ...

Nov 20, 2014 · /usr/bin/ld: cannot find -llapack Ask Question Asked 8 years, 11 months ago Modified 1 year, 5 months ago Viewed 42k times 46 I am seeking help for installation in ubuntu 14.04. I am installing a package in my pc. They have their makefiles. I have to run make. When I did I found error like..... You signed in with another tab or window. Reload to refresh your session. You signed out in another tab or window. Reload to refresh your session. You switched accounts on another tab or window.usr/bin/ld: cannot find -l<nameOfTheLibrary> But neither of these quite address the problem as I'm guessing I'm just missing a dependency/symlink to a library, but I'm unsure how to achieve this in the build. I can compile this successfully locally, but I have to module load mpi/openmpi-x86_64 to do so. My guess is that this is an openmpi issue ...I am trying to build MariaDB v10.3 with a musl tool chain on x86_64 Debian kernel v4.19. I have mainly been using the musl-gcc gcc wrapper to achieve this. The relevant packages I installed are asOct 7, 2015 · I'm trying to install the ruby gem for curl (curb) on Ubuntu 10.10, but during the installation, I get the error: /usr/bin/ld: cannot find -lcurl. But curl is installed! apt-get install curl says I've got the newest version. There is no curl-dev either. I'm getting these kinds of errors all the time, with curl, with libxml, with readline, and I ... Teams. Q&A for work. Connect and share knowledge within a single location that is structured and easy to search. Learn more about Teams847 2 13 25. Run the make with V=1 or VERBOSE=1 or whatever appropriate flag it requires and see what command it is actually running there. – Etan Reisner. Apr 7, 2015 at 15:36. it gives something like this Makefile:28: Makefile.config: No such file or directory. – Kapil.Feb 11, 2015 · 1 Answer Sorted by: 7 You need several development packages to build your program. Open a terminal and install the following packages (as they are not installed by default): sudo apt-get install libxmu-dev libxmu-headers freeglut3-dev libxext-dev libxi-dev Then restart your make process. Share Improve this answer Follow edited Feb 11, 2015 at 11:33 Aug 1, 2015 · Thanks for contributing an answer to Stack Overflow! Please be sure to answer the question.Provide details and share your research! But avoid …. Asking for help, clarification, or responding to other answers. The -lnetcdf issue is as you had before, so not too surprising that it still fails. However, you can use the utility nf-config --flibs to get details of the flags required to link a Fortran program against NetCDF. Note the --libs and --flibs in the output you present which have directories other than the single -L/usr/lib/x86_64-linux-gnu.Stack Exchange network consists of 183 Q&A communities including Stack Overflow, the largest, most trusted online community for developers to learn, share their knowledge, and build their careers.. Visit Stack ExchangeSep 15, 2020 · /usr/bin/ld: cannot find during linking g++. Load 7 more related questions Show fewer related questions Sorted by: Reset to default ... 当出现"/usr/bin/ld: cannot find -lprotobuf"的错误时,通常是因为编译器无法找到名为"libprotobuf.so"的库文件。. 这个错误提示表明编译器在默认的库文件搜索路径 …Mar 5, 2015 · In Ubuntu 22.04, you can do the following things to link gtest and gtest_main libraries: apt install googletest cd /usr/src/googletest mkdir build cd build cmake .. make cmake --install . This script will compile the static libraries libgmock.a libgmock_main.a libgtest.a libgtest_main.a. Jun 4, 2019 · 1 Answer. The ld command is telling you that it could not find the pq library. man ld will tell you about: -l namespec --library=namespec Add the archive or object file specified by namespec to the list of files to link. This option may be used any number of times. If namespec is of the form :filename, ld will search the library path for a file ... When using the -l linker ( /usr/bin/ld) option for specifying a library, the lib file prefix and .so suffix are omitted. Therefore, with -lGL we tell the linker to link against the …Aug 11, 2020 · Thanks for contributing an answer to Stack Overflow! Please be sure to answer the question.Provide details and share your research! But avoid …. Asking for help, clarification, or responding to other answers. Mar 10, 2011 · (The install instructions for Linux used to say to add /usr/lib/cuda or /usr/lib64/cuda to ld.so.conf - if the new version has changed the default lib path, you will need to use it instead.) Also, the getting started guide and release notes at: CUDA Toolkit Documentation are helpful. A bin card is a document used to keep track of the number of items held in a warehouse or stock room. The average business with inventory will use a bin card to record the number if items, a description of those items and any relevant notes...Changing that to -I/usr/include is unnecessary; the compiler will search in /usr/include anyway. If the sqlite3.h header is in /usr/include, it will be found without options. If it is somewhere else, like perhaps /usr/local/include or /opt/sqlite3/include, then you may well need to specify -I/usr/local/include or -I/opt/sqlite3/include on the ...It can't be read aloud or copied into an editor, and it doesn't index very well, meaning that other users with the same problem are less likely to find the answer here. Please edit your post to incorporate the relevant text directly (preferably using copy+paste to avoid transcription errors).2 Answers. (best to put it in bash_profile ). Adjust the path according to your installation. It sets the correct LIBRARY_PATH variable (not LD_LIBRARY_PATH, that is for runtime!) You should set the variable LD_LIBRARY_PATH and point it to the directory containing the missing library.It can't be read aloud or copied into an editor, and it doesn't index very well, meaning that other users with the same problem are less likely to find the answer here. Please edit your post to incorporate the relevant text directly (preferably using copy+paste to avoid transcription errors)./usr/bin/ld: cannot find -lfl collect2: error: ld returned 1 exit status How can I solve this problem? ubuntu; flex-lexer; Share. Improve this question. Follow edited Oct 21, 2018 at 16:21. rici. 235k 28 28 gold badges 239 239 silver badges 342 342 bronze badges.1. It means that OpenGL libraries are missing in the system. The solution is to install packets: sudo apt-get update sudo apt-get install libglu1-mesa-dev freeglut3-dev …Jul 15, 2017 · /usr/bin/ld: cannot find -lpthreads The problem here is the typo: -lpthreads should be -lpthread; there is no trailing s. As an alternative, at least on some versions of ld, you also can use just -pthread. 1 Answer. Sorted by: 3. Add the following flag, -L/usr/lib/mysql. I think. (It will instruct ld to look for libraries in the directory /usr/lib/mysql, which is where mysql is installed, but is not in the default search pat of ld.) Share. Improve this answer.The best solution in that case would be. sudo apt-get install r-base-dev. This will install libgfortran-5-dev and any other packages that are strictly necessary for building CRAN packages. Alternatively you could also use. sudo apt-get install r-cran-mnormt. and skip the binary installation. Share.I have installed libboost_python3 and am trying to link it to my program but get this error: /usr/bin/ld: cannot find -lboost_python3 Can anyone help me link to lboost_python3? ThanksIve been including libevent, added "-levent" in the gcc command, and ld used file /usr/lib/libevent.so, so it looks like the "lib" prefix and extension are being added automatically by ld. Keep it up.The linker (which is best invoked via the C compiler) is unable to find a library libbsd.so or libbsd.a in any of the directories it has been told to look in. In comments, you say you downloaded and built a libbsd file (which suffix did it have?), but you don't say where you installed it.847 2 13 25. Run the make with V=1 or VERBOSE=1 or whatever appropriate flag it requires and see what command it is actually running there. – Etan Reisner. Apr 7, 2015 at 15:36. it gives something like this Makefile:28: Makefile.config: No such file or directory. – Kapil.Mar 31, 2020 · Thanks for contributing an answer to Stack Overflow! Please be sure to answer the question.Provide details and share your research! But avoid …. Asking for help, clarification, or responding to other answers. /usr/bin/env: 'python': No such file or directory despite installs of python 2.7 and 3.8 0 unable to execute /usr/bin/apt-get: no such file or directory when installing OpenSSHThis is on Fedora, using scons. The previous successful installation was on Ubuntu. When I type scons, it gives the following error: /usr/bin/ld: cannot find -latlas. I have successfully installed atlas-devel via yum. If it helps, you'll find below the top level SConstruct File (--- indicates redacted code)/usr/bin/ld: error: cannot find -lncurses As well as the previous errors. I have spent the last 2 days searching both the Ubuntu forums and StackOverFlow. Any help would be appreciated. P.S. I don't know if this is important but when I try to run /usr/bin/ld I get this error: ld: fatal error: no input filesIn Ubuntu 22.04, you can do the following things to link gtest and gtest_main libraries: apt install googletest cd /usr/src/googletest mkdir build cd build cmake .. make cmake --install . This script will compile the static libraries libgmock.a libgmock_main.a libgtest.a libgtest_main.a.1 If you know where 32-bit libraries are installed, you can add -L/path/to/library/directory before -lstdc++ Share Improve this answer Follow answered Aug 1, 2015 at 20:02 faadiIf you’re missing a nut or bolt or nut and bolt or faced with a bin at the store filled with various-sized nuts and bolts, there’s no need to scrap your project. There are ways to figure out the right nut or bolt and the right size for your...Amazing comment! I would have never guessed that my nvidia driver could be the culprit. I'm seriously doubting ever installing an nvidia driver ever again because of all the issues I've had with them over the years.compiling - /usr/bin/ld: cannot find -lcrypt (rhel 6 ) - Unix & Linux Stack Exchange /usr/bin/ld: cannot find -lcrypt (rhel 6 ) Ask Question Asked 9 years, 6 months ago …/usr/bin/ld: cannot find -lquadmath Please read knut/knut/knut.spec.cmake → Buildrequires: libgfortran-static .... i.e. libgfortran. a Probably the same for -lquadmath : libquadmath.aMay 28, 2018 · The best solution in that case would be. sudo apt-get install r-base-dev. This will install libgfortran-5-dev and any other packages that are strictly necessary for building CRAN packages. Alternatively you could also use. sudo apt-get install r-cran-mnormt. and skip the binary installation. Share. /usr/bin/ld: cannot find -lstdc++ for Ubuntu while trying to "swift build" Perfect2 project. Ask Question Asked 6 years, 11 months ago. Modified 4 years, 4 months ago. If you further run into the issue gfortran: command not found, make sure that you have /usr/bin/gfortran linking to the actual version of gfortran you have installed (e.g. linking to gfortran-4.9 ): sudo update-alternatives --install /usr/bin/gfortran gfortran /usr/bin/gfortran-11 70. Share. Improve this answer. Nov 23, 2022 · Thanks for contributing an answer to Stack Overflow! Please be sure to answer the question.Provide details and share your research! But avoid …. Asking for help, clarification, or responding to other answers. 180. I am attempting to link an application with g++ on this Debian lenny system. ld is complaining it cannot find specified libraries. The specific example here is ImageMagick, but I am having similar problems with a few other libraries too. I am calling the linker with: g++ -w (..lots of .o files/include directories/etc..) \ -L/usr/lib -lmagic."/usr/bin/ld: cannot find -lcudart" Ask Question Asked 9 years, 2 months ago Modified 4 years, 4 months ago Viewed 158k times 16 I am newbie to Ubuntu and using Ubuntu 14.04 64-bit. I want to make a project that uses cuda and opencv I got the following error when running cmake . && makeI had the same problem and I managed to fix it, I don't know if it can be a problem later on, but for now it's going well. Inside the /usr/lib/x86_64-linux-gnu directory I checked which files the symbolic links made, and I saw that in my case there was no libGL.so.In your case it even exists, you can try to delete it and create the symbolic link again.I think you need to include the directory with libpython3.6m.so in LIBRARY_PATH as well as LD_LIBRARY_PATH. The former is searched at link time. The latter at run time. I had tried this way, But still, it didn't work for my case. so I just soft linked the libpython3.6m.so to one of the default LD_LIBRARY_PATH.Find centralized, trusted content and collaborate around the technologies you use most. ... DPDK cannot find -lnuma. Ask Question Asked 5 years, 9 months ago. Modified 3 years, ... drivers/event/skeleton == Build drivers/event/sw == Build drivers/event/octeontx == Build app == Build app/test-pmd LD testpmd /usr/bin/ld: …Mar 22, 2016 · if your project linking library is not in the folder of this list, ld won't find it unless either a special linking variable set LD_LIBRARY_PATH with the path to your library or a complete path/library name provided in cmake target_link_libraries directive. If you further run into the issue gfortran: command not found, make sure that you have /usr/bin/gfortran linking to the actual version of gfortran you have installed (e.g. linking to gfortran-4.9 ): sudo update-alternatives --install /usr/bin/gfortran gfortran /usr/bin/gfortran-11 70. Share. Improve this answer.Hi all Guys, I'm having a situation trying to compile a source when jam is linking all the objects files is looking for a Library "-lbz2" if anyone had this situation before and know how to fix it please send a solution or comments about it.180. I am attempting to link an application with g++ on this Debian lenny system. ld is complaining it cannot find specified libraries. The specific example here is ImageMagick, but I am having similar problems with a few other libraries too. I am calling the linker with: g++ -w (..lots of .o files/include directories/etc..) \ -L/usr/lib -lmagic. Hello C++ and/or ROS Experts I just made a fresh install of Ubuntu 12.04 and ROS. My old installations was also on ubunru 12.04, and it worked great. But now when i try to make or rosmake on of mySo I found a solution. Apparently the linker wasnt able to locate libcudart binary. So used find to get its location: find /usr/ -name libcudart_static* Got its path …1 Answer. The linker would be unable to find something like libcrypto.so.1 based on the combo of default/configured and arg-based set of directories to search. Most likely your lib resides in a dir outside of the linker's default list. After identifying the lib install dir, replace /usr/local/lib64 within this example:23:02:20: Running steps for project WallpaperAppQt... 23:02:20: Configuration unchanged, skipping qmake step. 23:02:20: Starting: "/usr/bin/make" g++ -m64 -o WallpaperAppQt main.o mainwindow.o moc_mainwindow.o -L/usr/X11R6/lib64 -lQt5Widgets -L/usr/lib/x86_64-linux-gnu -lQt5Gui -lQt5Core -lGL -lpthread /usr/bin/ld: …4. As shown here, it looks like you need to make a link by the following command: sudo ln -s libboost_python-py36.so libboost_python3.so. Share. Improve this answer. Follow. edited Dec 22, 2019 at 7:53. answered Dec 21, 2019 at 16:28. user3980558.Teams. Q&A for work. Connect and share knowledge within a single location that is structured and easy to search. Learn more about Teamsusr/bin/ld: cannot find -l<nameOfTheLibrary> Hot Network Questions For large commercial jets is it possible to land and slow sufficiently to leave the runway without using reverse thrust or brakesIn addition to having the flex executable in your path, you need to have libfl.so and libfl.a (and libfl_pic.a if it exists) in your library search path (typically /usr/lib or /usr/local/lib, depending on whether Flex came from a system package or not). If you have Flex in a non-standard location, specify the library search path with -L:I think you need to include the directory with libpython3.6m.so in LIBRARY_PATH as well as LD_LIBRARY_PATH. The former is searched at link time. The latter at run time. I had tried this way, But still, it didn't work for my case. so I just soft linked the libpython3.6m.so to one of the default LD_LIBRARY_PATH.Hi, I just bought a GTX 460 and installed Ubuntu 10.10 When I try to compile the SDK sample programs appears the following error: /usr/bin/ld: cannot find -lcuda collect2: ld returned 1 exit status make[1]: ***[../.…Hi, I'm trying to make a QWidget for a university project, and I started from the most basic stuff following qt's official tutorials. However I' m encountering a compile problem: I keep getting this error: /usr/bin/ld: …The above command is from a make file while executing make using V=1 (verbose) to understand if I have passed on directories properly or not. And it exits with the following error: /usr/bin/ld: cannot find -lcrypto collect2: ld returned 1 exit status. My understanding from the gcc command, -Bstatic tries to statically link lib crypto (-lcrypto). While making my program on Redhat based linux (amd64), I get this error: /usr/bin/ld: cannot find -lz collect2: ld returned 1 exit status Searching internet reveals that I have t install zlib 32bit . Stack Exchange Network. Stack Exchange network consists of 183 Q&A communities including Stack Overflow, ...where a separate shell script interprets the leading "-s" to put the library in the static section. A comment at the top of that file mentions that "-l" can be used as an alternative where the script will then determine if a static or dynamic library already exists on the system and use the appropriate one.Aug 14, 2020 · I have installed libboost_python3 and am trying to link it to my program but get this error: /usr/bin/ld: cannot find -lboost_python3 Can anyone help me link to lboost_python3? Thanks causing the linker to look for libraries in a non-existent directory with an empty name, as well as /usr/local/lib. Removing the comma should fix it. Removing the comma should fix it. Share/usr/bin/ld: cannot find -lcuda /usr/bin/ld: cannot find -lcudart removing -lcuda and -lcudart generates undefined reference to cuda functions errors. Sep 15, 2020 · /usr/bin/ld: cannot find during linking g++. Load 7 more related questions Show fewer related questions Sorted by: Reset to default ... Feb 11, 2016 · usr/bin/ld: cannot find -l<nameOfTheLibrary> Hot Network Questions For large commercial jets is it possible to land and slow sufficiently to leave the runway without using reverse thrust or brakes It would appear that you have not completely followed the "Establishing a Build Environment" instructions completely. I see you're trying to build Android Ice Cream Sandwich (4.0.1) on Ubuntu 17 - please note that this is not a supported build / host environment and may not function correctly.Aug 8, 2017 · 1. It would appear that you have not completely followed the "Establishing a Build Environment" instructions completely. I see you're trying to build Android Ice Cream Sandwich (4.0.1) on Ubuntu 17 - please note that this is not a supported build / host environment and may not function correctly. It would appear that you have a misconfigured or ... If you further run into the issue gfortran: command not found, make sure that you have /usr/bin/gfortran linking to the actual version of gfortran you have installed (e.g. linking to gfortran-4.9 ): sudo update-alternatives --install /usr/bin/gfortran gfortran /usr/bin/gfortran-11 70. Share. Improve this answer.Wwwcostco.com, Busted carteret county nc, Octopus r34, Great clips beard trim price, Ups store gettysburg pa, Conan exiles greater wolf food, Where is helgi hiding skyrim, Pogil protein structure answers, Oakleyraeee shower, Unit 7 mcq, Channel 2 news lottery, Craigslist cranford nj, Used motorcycles for sale craigslist near me, Wetm past anchors

If you’re missing a nut or bolt or nut and bolt or faced with a bin at the store filled with various-sized nuts and bolts, there’s no need to scrap your project. There are ways to figure out the right nut or bolt and the right size for your.... Old farm rd

Usr bin ld cannot findcicis pizza arlington photos

Hi, I just bought a GTX 460 and installed Ubuntu 10.10 When I try to compile the SDK sample programs appears the following error: /usr/bin/ld: cannot find -lcuda collect2: ld returned 1 exit status make[1]: ***[../.…@Alex please don't mix gcc and ld flags. They are totally different. If you want static linking in gcc, use -static.Also you could be interesting in -static-libgcc.They are tons of undocumented gcc flags because it converts virtually all input flags to internal form before reprocessing, so don't surprise on unexpected result from undocumented flags.The above solution didn't quite do it for me as I was using pip to install mysql-python, but was definitely a big push in the right direction.How often have you pulled out the deli ham from the fridge only to find that it’s past the “best by” date? Do you take a chance on it anyway, or do you toss it in the garbage? If you go for the waste bin, you might not be taking full advant...Find centralized, trusted content and collaborate around the technologies you use most. Learn more about Collectives Teams. Q&A for work ... /usr/bin/ld: cannot find -ltcmalloc_minimal0. I had checked /usr/lib and the library is there . …/usr/bin/ld: error: cannot find -lncurses As well as the previous errors. I have spent the last 2 days searching both the Ubuntu forums and StackOverFlow. Any help would be appreciated. P.S. I don't know if this is important but when I try to run /usr/bin/ld I get this error: ld: fatal error: no input files1 Answer. Sorted by: 3. The makefile is generating a link command that reads: ... -l -L/usr/lib ... The link command in the makefile is likely specified as -l$ (SOMEVARIABLE), here, and the variable is not set for some reason, so it gets expanded as an empty string. As such, this gets interpreted as a directive to link with a shared library ...The new arm is a more sophisticated take on the company’s existing robotics, adding the ability to pick and place specific objects from bins. The bin-moving robots designed by Kiva Systems still form the foundation of Amazon’s warehouse rob.../usr/bin/ld: cannot find -lpcre2-8 /usr/bin/ld: cannot find -lbz2 /usr/bin/ld: cannot find -lz collect2: error: ld returned 1 exit status rstudio; ld; Share. Improve this question. Follow edited May 1, 2021 at 19:16. N0rbert. 97.7k 34 34 gold badges 240 240 silver badges 428 428 bronze badges.hi. I am trying to get an ogl-programm compiled. I have installed arch new. My old installation still works. I use the same eclipse-project on both arch-installations.A GLX version issue is something I expect on when the system is strangely configured and doesn't support OpenGL (e.g., some old VM or really old hardware), or it might be a graphics card drive issue.Stack Exchange network consists of 183 Q&A communities including Stack Overflow, the largest, most trusted online community for developers to learn, share their knowledge, and build their careers.. Visit Stack Exchangeusr/bin/ld: cannot find -l<nameOfTheLibrary> 1 /usr/bin/ld: cannot find -lgd. 4 c++ cmake/make: linker ld does not find library (missing path?) 1 Linux, C++, Lua 5.3, CMake, undefined reference. 8 Linking with CMakeLists: ld cannot find library. 0 ...10. You are not specifying the location of the CUDA libraries to the linker, that is why the linkage is failing. nvcc is "automagically" configured to find the CUDA runtime library components, but if you are linking with a host compiler directly, you will need to explicitly specify their location to the compiler. It would appear that you have not completely followed the "Establishing a Build Environment" instructions completely. I see you're trying to build Android Ice Cream Sandwich (4.0.1) on Ubuntu 17 - please note that this is not a supported build / host environment and may not function correctly."/usr/bin/ld: cannot find -lcudart" Ask Question Asked 9 years, 2 months ago Modified 4 years, 4 months ago Viewed 158k times 16 I am newbie to Ubuntu and using Ubuntu 14.04 64-bit. I want to make a project that uses cuda and opencv I got the following error when running cmake . && make当出现"/usr/bin/ld: cannot find -lprotobuf"的错误时,通常是因为编译器无法找到名为"libprotobuf.so"的库文件。. 这个错误提示表明编译器在默认的库文件搜索路径中找不到该库文件。. 要解决这个问题,可以尝试以下几个方法:. 确保protobuf库已正确安装:首先,确保你 ...The Church of Jesus Christ of Latter-day Saints (LDS) has long emphasized the importance of tithing as a way for members to show their faith and support the work of the church. Traditionally, members would bring their tithes and offerings i...In today’s digital age, many religious organizations are embracing technology to make it more convenient for their members to contribute financially. The Church of Jesus Christ of Latter-day Saints (LDS) is no exception.Nov 23, 2022 · Thanks for contributing an answer to Stack Overflow! Please be sure to answer the question.Provide details and share your research! But avoid …. Asking for help, clarification, or responding to other answers. 解决方法:. (1)先判断在/usr/lib 下的相对应的函式库文件 (.so) 的symbolic link 是否正确. 若不正确改成正确的连结目标即可解决问题。. (2)若不是symbolic link 的问题引起,而是系统缺少相对应的lib安装lib即可解决。. (3)如何安装缺少的lib:. 以上面三个错误讯息为例 .../usr/bin/ld: cannot find -lgcc_s collect2: ld returned 1 exit status I saw on another forum that this is related to libgcc, when looking for libgcc I get /usr/bin/ld: cannot find -lgfortran collect2: error: ld returned 1 exit status And I started to look for a solution. I checked if I had r-base-dev. sudo apt install r-base-dev Reading package lists... Done Building dependency tree Reading state information... Done r-base-dev is already the newest version (4.0.3-1.1804.0).Thanks for @jww's answer; but my problem is different.. I've got replies from llvmdev mailing list (see the thread) and they said that:. libclang_rt.san is now gone. Fresh compiler-rt build doesn't contain this library, and fresh Clang is not using it.usr/bin/ld: cannot find -l<nameOfTheLibrary> But neither of these quite address the problem as I'm guessing I'm just missing a dependency/symlink to a library, but I'm unsure how to achieve this in the build. I can compile this successfully locally, but I have to module load mpi/openmpi-x86_64 to do so. My guess is that this is an openmpi issue ...Amazing comment! I would have never guessed that my nvidia driver could be the culprit. I'm seriously doubting ever installing an nvidia driver ever again because of all the issues I've had with them over the years.I found a post link seems to have a similar issue. I am not quite sure, but it seems to me that I did not add "fortran" in the "--enable-languages=" option part, neither did I call "./contrib/download_prerequisites" in the …1. @matt, (1) urge your administrators to install libjpeg-dev (or whatever the package name is ... I'm on ubuntu), as that is the best solution; lacking that, (2) you'll need to find the source of the libjpeg package (this is linux, not R) and compile it yourself, then install it to a location where you have perms (perhaps somewhere in your ...Hello C++ and/or ROS Experts I just made a fresh install of Ubuntu 12.04 and ROS. My old installations was also on ubunru 12.04, and it worked great. But now when i try to make or rosmake on of myI think you need to include the directory with libpython3.6m.so in LIBRARY_PATH as well as LD_LIBRARY_PATH. The former is searched at link time. The latter at run time. I had tried this way, But still, it didn't work for my case. so I just soft linked the libpython3.6m.so to one of the default LD_LIBRARY_PATH.Use ld.so. The easiest way is to copy blpapi3_64.so to /usr/local/lib. If you then call ldconfig to update the cache you should be all set. You can test this via ldconfig -p | grep blpapi which should show it.Yes but it would at least give you a hint of the name of the lib to look for. fixed it for me for eventmachine ruby gem that would not install. Hope that helps someone. For me, the problem was that LIBRARY_PATH was …I'm trying to compile my next basic c program after hello-world. This contains two supporting modules. I have Ubuntu running in a VM through VirtualBox on a mac. Everything is up to date but I c...1 Answer. Sorted by: 3. The makefile is generating a link command that reads: ... -l -L/usr/lib ... The link command in the makefile is likely specified as -l$ (SOMEVARIABLE), here, and the variable is not set for some reason, so it gets expanded as an empty string. As such, this gets interpreted as a directive to link with a shared library ...Find centralized, trusted content and collaborate around the technologies you use most. Learn more about Collectives Teams. Q&A for work ... /usr/bin/ld: cannot find -ltcmalloc_minimal0. I had checked /usr/lib and the library is there . …The above command is from a make file while executing make using V=1 (verbose) to understand if I have passed on directories properly or not. And it exits with the following error: /usr/bin/ld: cannot find -lcrypto collect2: ld returned 1 exit status. My understanding from the gcc command, -Bstatic tries to statically link lib crypto (-lcrypto). 1. It means that OpenGL libraries are missing in the system. The solution is to install packets: sudo apt-get update sudo apt-get install libglu1-mesa-dev freeglut3-dev mesa-common-dev. After that application compiles correctly. Share.I am newbie in Linux, try to install PHP 5.6 on Debian 7, got this error, have no idea, also haven't found any solution on the internet, can some one support me pls. /usr/bin/ld: cannot find -lodbc. thanksIn today’s digital age, online platforms have significantly transformed the way we handle our finances, including charitable donations. The Church of Jesus Christ of Latter-day Saints (LDS) recognizes the importance of embracing technology ...Get a virtual cloud desktop with the Linux distro that you want in less than five minutes with Shells! With over 10 pre-installed distros to choose from, the worry-free installation life is here! Whether you are a digital nomad or just looking for flexibility, Shells can put your Linux machine on the device that you want to use.First, you need to know the naming rule of lxxx: /usr/bin/ld: cannot find -lc /usr/bin/ld: cannot find -lltdl /usr/bin/ld: cannot find -lXtst. lc means libc.so, lltdl means libltdl.so, lXtst means libXts.so. So, it is lib + lib-name + .so. Once we know the name, we can use locate to find the path of this lxxx.so file.`ld` undefined reference error, but libraries are linked to by CMake and symbols exist Hot Network Questions Non-trivial extension of representations have same central character180. I am attempting to link an application with g++ on this Debian lenny system. ld is complaining it cannot find specified libraries. The specific example here is ImageMagick, but I am having similar problems with a few other libraries too. I am calling the linker with: g++ -w (..lots of .o files/include directories/etc..) \ -L/usr/lib -lmagic. 1 Answer. Sorted by: 3. The makefile is generating a link command that reads: ... -l -L/usr/lib ... The link command in the makefile is likely specified as -l$ (SOMEVARIABLE), here, and the variable is not set for some reason, so it gets expanded as an empty string. As such, this gets interpreted as a directive to link with a shared library ...usr / bin / ld: cannot find -l <nameOfTheLibrary> I've created a symlink to my library lcated in the other directory. Is there anything else I need to do to make this …A bin card is a document used to keep track of the number of items held in a warehouse or stock room. The average business with inventory will use a bin card to record the number if items, a description of those items and any relevant notes...This is on Fedora, using scons. The previous successful installation was on Ubuntu. When I type scons, it gives the following error: /usr/bin/ld: cannot find -latlas. I have successfully installed atlas-devel via yum. If it helps, you'll find below the top level SConstruct File (--- indicates redacted code)g++ -Wall -I/home/alwin/Development/Calculator/ main.cpp -lcalc -o calculator. I get the following error: /usr/bin/ld: cannot find -lcalc collect2: ld returned 1 exit status. Can …You signed in with another tab or window. Reload to refresh your session. You signed out in another tab or window. Reload to refresh your session. You switched accounts on another tab or window.Feb 8, 2013 · 22. I am using Ubuntu and gcc and g++ were working fine but today it showed: cannot find -lm cannot find -lc. I searched and found it has something to do with /usr/bin/ld. Which is a symlink (I hope) to lbd.bdf. I pasted that file in the directory from Ubuntu of some friends PC. Yes. I have installed it. For some odd reason the linker can't find -lglfw3 but can find -lglfw for me, (whenever I install either libglfw3-dev or libglfw-dev, it removes the other one if it is installed) so I have to use either way the -lglfw flag. I had a similar issue when I tried to build a Cocos2d-x project on OpenSuSE.Yes. I have installed it. For some odd reason the linker can't find -lglfw3 but can find -lglfw for me, (whenever I install either libglfw3-dev or libglfw-dev, it removes the other one if it is installed) so I have to use either way the -lglfw flag. I had a similar issue when I tried to build a Cocos2d-x project on OpenSuSE.usr / bin / ld: cannot find -l <nameOfTheLibrary> I've created a symlink to my library lcated in the other directory. Is there anything else I need to do to make this work? linux; libraries; c; g; Mar 26, 2019 in Linux Administration by Damon Salvatore • 5,980 points • 11,707 views.The best solution in that case would be. sudo apt-get install r-base-dev. This will install libgfortran-5-dev and any other packages that are strictly necessary for …I want to install caffe with conda. In the tutorial I followed it was told to install these stuff sudo apt-get install protobuf-compiler libprotobuf-dev Soon I found out that is was out-of-date ...The above solution didn't quite do it for me as I was using pip to install mysql-python, but was definitely a big push in the right direction.4. As shown here, it looks like you need to make a link by the following command: sudo ln -s libboost_python-py36.so libboost_python3.so. Share. Improve this answer. Follow. edited Dec 22, 2019 at 7:53. answered Dec 21, 2019 at 16:28. user3980558.I get /usr/bin/ld: cannot find -lconfig++ I assume this is related to libconfig++ library which I find it to be in /usr/lib64/libconfig++.so by running ld -lconfig++ --verbose This is what I get when I run ld -lconfig++ --verbose/usr/bin/ld: cannot find -lgcc_s collect2: ld returned 1 exit status I saw on another forum that this is related to libgcc, when looking for libgcc I get1 Answer. Sorted by: 3. The makefile is generating a link command that reads: ... -l -L/usr/lib ... The link command in the makefile is likely specified as -l$ (SOMEVARIABLE), here, and the variable is not set for some reason, so it gets expanded as an empty string. As such, this gets interpreted as a directive to link with a shared library ...Rcpp error: /usr/bin/ld cannot find -lgfortran. Ask Question Asked 9 years, 4 months ago. Modified 9 years, 4 months ago. Viewed 2k times 3 I am working through the book "Seamless R and C++ Integration with Rcpp". I am using R version 3.1.0 on Ubuntu 12.04. I cannot figure out how to properly link the necessary libraries.@mzahana Another possible reason is that you use catkin build instead of catkin_make, which also has not been tested yet. The catkin build is a more updated tools that builds each package in a workspace’s source space in isolation in order to prevent build-time cross-talk. This may cause linking problem between the packages.Hi, I'm trying to make a QWidget for a university project, and I started from the most basic stuff following qt's official tutorials. However I' m encountering a compile problem: I keep getting this error: /usr/bin/ld: …BIOS files such as ROM1.bin and SCPH1000.bin need to be placed in the same folder where ROMs are stored for PS2emu to work. BIOSs are required for any PS2 emulator to work. BIOS stand for “basic input/output system,” and they are used in mo...InvestorPlace - Stock Market News, Stock Advice & Trading Tips While technology offers some of the most compelling investment opportunities, t... InvestorPlace - Stock Market News, Stock Advice & Trading Tips While technology offers som...Stack Exchange Network. Stack Exchange network consists of 183 Q&A communities including Stack Overflow, the largest, most trusted online community for developers to learn, share their knowledge, and build their careers.. Visit Stack ExchangeI am newbie in Linux, try to install PHP 5.6 on Debian 7, got this error, have no idea, also haven't found any solution on the internet, can some one support me pls. /usr/bin/ld: cannot find -lodbc. thanksThe billionaire prince and investor has been arrested in what Saudi Arabia calls a corruption crackdown. Here's his net worth. By clicking "TRY IT", I agree to receive newsletters and promotions from Money and its partners. I agree to Money...Aug 12, 2014 · LD_LIBRARY_PATH is used to modify the behaviour of the ldconfig and related tools when looking for the libraries, at execution time.. The ld linker tool doesn't use this variable. 847 2 13 25. Run the make with V=1 or VERBOSE=1 or whatever appropriate flag it requires and see what command it is actually running there. – Etan Reisner. Apr 7, 2015 at 15:36. it gives something like this Makefile:28: Makefile.config: No such file or directory. – Kapil.Of course, spend a few days reading the documentation of GCC and of Clang (and of ld from binutils; since both clang++ and g++ are running ld). Read carefully about invoking GCC . The order of program arguments to g++ (and also to clang++ ) are important.The simplest way is to wipe the system and start from scratch. But this is only the ultima ratio.We need a lot more of information if you want us to repair your system. Think about what you need to know if a stranger comes and tells you such a problem./usr/bin/ld: cannot find -lpcre2-8 /usr/bin/ld: cannot find -lbz2 /usr/bin/ld: cannot find -lz collect2: error: ld returned 1 exit status rstudio; ld; Share. Improve this question. Follow edited May 1, 2021 at 19:16. N0rbert. 97.7k 34 34 gold badges 240 240 silver badges 428 428 bronze badges.I am trying to compile in Linux Mint 17.2 a main.c code and assembly code pstring.s. When I try to link the codes, the gcc returns: /usr/bin/ld: cannot find -lgcc. Does anyone know what I need to c...I'm trying to install a script on my server. But it doesn't finish the job at the last step. ./make.sh /usr/bin/ld: cannot find -lssl collect2: ld returned 1 exit status How do I fix above issue?causing the linker to look for libraries in a non-existent directory with an empty name, as well as /usr/local/lib. Removing the comma should fix it. Removing the comma should fix it. ShareAnd then link it to the executables. add_executable (keygen_bls src/keygen_bls.cpp) target_link_libraries (keygen_bls blstmp relic_s) With this cmake runs fine. However when I run make then I get. /usr/bin/ld: cannot find -lblstmp /usr/bin/ld: cannot find -lrelic_s. Even though those libraries are at the places I specified above and …Get a virtual cloud desktop with the Linux distro that you want in less than five minutes with Shells! With over 10 pre-installed distros to choose from, the worry-free installation life is here! Whether you are a digital nomad or just looking for flexibility, Shells can put your Linux machine on the device that you want to use.. Excerpt crossword clue 7 letters, Neverending codycross, Codes for ge universal remote cl5, Backpage concord ca, Sam club washer and dryer, Acrid warframe, Obanai and mitsuri matching pfp, Shower curtains 84 long, Dark purple highlights in brown hair.